GpuUtilsUnitTests (Failed)

GROMACS version: 2020.4
i got this error

Total Test time (real) = 213.00 sec

The following tests FAILED:
5 - MdlibUnitTest (Failed)
10 - EwaldUnitTests (Failed)
12 - GpuUtilsUnitTests (Failed)
Errors while running CTest
CMakeFiles/run-ctest-nophys.dir/build.make:76: recipe for target ‘CMakeFiles/run-ctest-nophys’ failed
make[3]: *** [CMakeFiles/run-ctest-nophys] Error 8
CMakeFiles/Makefile2:2466: recipe for target ‘CMakeFiles/run-ctest-nophys.dir/all’ failed
make[2]: *** [CMakeFiles/run-ctest-nophys.dir/all] Error 2
CMakeFiles/Makefile2:2445: recipe for target ‘CMakeFiles/check.dir/rule’ failed
make[1]: *** [CMakeFiles/check.dir/rule] Error 2
Makefile:268: recipe for target ‘check’ failed
make: *** [check] Error 2

the command is

make check

during installation gromacs

What hardware, compiler, and libraries did you use?

i solved it Thanks so much for your replying and sorry for late reply