Regressiontests/complex (Failed) on M1 Mac

GROMACS version: 2021.4
GROMACS modification: Yes/No
Here post your question:

Hello. I’ve been trying to install gromacs-2021.4 on M1 mac and encountered this:

66/69 Test #66: regressiontests/complex …***Failed 13.61 sec
sh: line 1: 11418 Abort trap: 6 gmx mdrun -notunepme > mdrun.out 2>&1

Abnormal return value for ’ gmx mdrun -notunepme >mdrun.out 2>&1’ was -1
FAILED. Check mdrun.out, md.log file(s) in nbnxn_pme_order6 for nbnxn_pme_order6
.
.
.
1 out of 48 complex tests FAILED
99% tests passed, 1 tests failed out of 69

Label Time Summary:
GTest = 36.62 secproc (63 tests)
IntegrationTest = 13.19 sec
proc (18 tests)
MpiTest = 2.85 secproc (6 tests)
SlowTest = 7.96 sec
proc (6 tests)
UnitTest = 15.47 sec*proc (39 tests)

Total Test time (real) = 58.03 sec

The following tests FAILED:
66 - regressiontests/complex (Failed)
Errors while running CTest
make[3]: *** [CMakeFiles/run-ctest-nophys] Error 8
make[2]: *** [CMakeFiles/run-ctest-nophys.dir/all] Error 2
make[1]: *** [CMakeFiles/check.dir/rule] Error 2
make: *** [check] Error 2

while running make check during installation. I don’t know how to resolve this and I’d really appreciate your help.

Best,

Viejay